Reaction Details
TargetKappa-type opioid receptor
LigandBDBM50346474
Substrate/Competitorn/a
Meas. Tech.ChEMBL_751945 (CHEMBL1785787)
Ki 0.45±n/a nM
Citation Sunnam, SKRack, ESchepmann, DWünsch, B Synthesis of 7,9-diazabicyclo[4.2.2]decanes as conformationally restricted κ receptor agonists: fine tuning of the dihedral angle of the ethylenediamine pharmacophore. Eur J Med Chem46:1972-82 (2011) 
 
Kappa-type opioid receptor
Name:Kappa-type opioid receptor
Type:G Protein-Coupled Receptor (GPCR)
Mol. Mass.:42648.76
Organism:Homo sapiens (Human)
Description:P41145
Residue:380
BDBM50346474
NameBDBM50346474
Synonyms:(R)-4-[2-(3,4-Dichloro-phenyl)-acetyl]-3-pyrrolidin-1-ylmethyl-piperazine-1-carboxylic acid methyl ester (R)-methyl4-(2-(3,4-dichlorophenyl)acetyl)-3-(pyrrolidin-1-ylmethyl)piperazine-1-carboxylate 4-[2-(3,4-Dichloro-phenyl)-acetyl]-3-pyrrolidin-1-ylmethyl-piperazine-1-carboxylic acid methyl ester CHEMBL277863 GR-89696
TypeSmall organic molecule
Emp. Form.C19H25Cl2N3O3
Mol. Mass.414.326
SMILESCOC(=O)N1CCN([C@H](CN2CCCC2)C1)C(=O)Cc1ccc(Cl)c(Cl)c1