Reaction Details
TargetKappa-type opioid receptor
LigandBDBM50316621
Substrate/Competitorn/a
Meas. Tech.ChEMBL_751945 (CHEMBL1785787)
Ki 0.31±n/a nM
Citation Sunnam, SKRack, ESchepmann, DWünsch, B Synthesis of 7,9-diazabicyclo[4.2.2]decanes as conformationally restricted κ receptor agonists: fine tuning of the dihedral angle of the ethylenediamine pharmacophore. Eur J Med Chem46:1972-82 (2011) 
 
Kappa-type opioid receptor
Name:Kappa-type opioid receptor
Type:G Protein-Coupled Receptor (GPCR)
Mol. Mass.:42648.76
Organism:Homo sapiens (Human)
Description:P41145
Residue:380
BDBM50316621
NameBDBM50316621
Synonyms:(R)-methyl 4-(2-(3,4-dichlorophenyl)acetyl)-3-((R)-1-(pyrrolidin-1-yl)ethyl)piperazine-1-carboxylate | CHEMBL1095519
TypeSmall organic molecule
Emp. Form.C20H27Cl2N3O3
Mol. Mass.428.353
SMILESCOC(=O)N1CCN([C@H](C1)[C@@H](C)N1CCCC1)C(=O)Cc1ccc(Cl)c(Cl)c1