Reaction Details
TargetHypoxia-inducible factor 1-alpha
LigandBDBM50346793
Substrate/Competitorn/a
Meas. Tech.ChEMBL_753564 (CHEMBL1799182)
IC50 54±n/a nM
Citation Xia, YJin, YKaur, NChoi, YLee, K HIF-1a inhibitors: synthesis and biological evaluation of novel moracin O and P analogues. Eur J Med Chem46:2386-96 (2011) 
 
Hypoxia-inducible factor 1-alpha
Name:Hypoxia-inducible factor 1-alpha
Type:Protein
Mol. Mass.:92647.24
Organism:Homo sapiens (Human)
Description:Q16665
Residue:826
BDBM50346793
NameBDBM50346793
Synonyms:CHEMBL1795436
TypeSmall organic molecule
Emp. Form.C23H24O6
Mol. Mass.396.4331
SMILESCCOC(=O)COc1ccc(cc1)-c1cc2cc3CC(Oc3cc2o1)C(C)(C)O