Reaction Details
TargetCalmodulin-1
LigandBDBM50346808
Substrate/Competitorn/a
Meas. Tech.ChEMBL_753876 (CHEMBL1798138)
IC50 57270±n/a nM
Citation Reyes-Ramírez, ALeyte-Lugo, MFigueroa, MSerrano-Alba, TGonzález-Andrade, MMata, R Synthesis, biological evaluation, and docking studies of gigantol analogs as calmodulin inhibitors. Eur J Med Chem46:2699-708 (2011) 
 
Calmodulin-1
Name:Calmodulin-1
Type:Protein
Mol. Mass.:16813.73
Organism:Human
Description:P0DP23
Residue:149
BDBM50346808
NameBDBM50346808
Synonyms:CHEMBL1796024
TypeSmall organic molecule
Emp. Form.C17H16O5
Mol. Mass.300.3059
SMILESCOc1cc(O)cc(c1)C(=O)\C=C\c1ccc(O)c(OC)c1