Reaction Details
TargetCarbonic anhydrase 2
LigandBDBM35726
Substrate/Competitorn/a
Meas. Tech.ChEMBL_753078 (CHEMBL1799006)
Ki 50±n/a nM
Citation Biswas, SAggarwal, MGüzel, ÖScozzafava, AMcKenna, RSupuran, CT Conformational variability of different sulfonamide inhibitors with thienyl-acetamido moieties attributes to differential binding in the active site of cytosolic human carbonic anhydrase isoforms. Bioorg Med Chem19:3732-8 (2011) 
 
Carbonic anhydrase 2
Name:Carbonic anhydrase 2
Type:Enzyme
Mol. Mass.:29250.71
Organism:Homo sapiens (Human)
Description:P00918
Residue:260
BDBM35726
NameBDBM35726
Synonyms:sulfonamide deriv., 5a
TypeSmall organic molecule
Emp. Form.C12H12N2O3S2
Mol. Mass.296.365
SMILESNS(=O)(=O)c1ccc(NC(=O)Cc2cccs2)cc1