Reaction Details
TargetCarbonic anhydrase 7
LigandBDBM35727
Substrate/Competitorn/a
Meas. Tech.ChEMBL_753080 (CHEMBL1799008)
Ki 7±n/a nM
Citation Biswas, SAggarwal, MGüzel, ÖScozzafava, AMcKenna, RSupuran, CT Conformational variability of different sulfonamide inhibitors with thienyl-acetamido moieties attributes to differential binding in the active site of cytosolic human carbonic anhydrase isoforms. Bioorg Med Chem19:3732-8 (2011) 
 
Carbonic anhydrase 7
Name:Carbonic anhydrase 7
Type:Enzyme
Mol. Mass.:29664.11
Organism:Homo sapiens (Human)
Description:Human cloned isozyme.
Residue:264
BDBM35727
NameBDBM35727
Synonyms:sulfonamide deriv., 5b
TypeSmall organic molecule
Emp. Form.C12H11FN2O3S2
Mol. Mass.314.356
SMILESNS(=O)(=O)c1ccc(NC(=O)Cc2cccs2)c(F)c1