Reaction Details
TargetAcetylcholinesterase
LigandBDBM50347127
Substrate/Competitorn/a
Meas. Tech.ChEMBL_753198 (CHEMBL1799291)
IC50 3182±n/a nM
Citation Akhtar, MNLam, KWAbas, FMaulidiani, naAhmad, SShah, SAAtta-Ur-Rahman, AChoudhary, MILajis, NH New class of acetylcholinesterase inhibitors from the stem bark of Knema laurina and their structural insights. Bioorg Med Chem Lett21:4097-103 (2011) 
 
Acetylcholinesterase
Name:Acetylcholinesterase
Type:Enzyme
Mol. Mass.:71812.79
Organism:Electrophorus electricus (Electric eel)
Description:n/a
Residue:633
BDBM50347127
NameBDBM50347127
Synonyms:CHEMBL1797234
TypeSmall organic molecule
Emp. Form.C22H34O4
Mol. Mass.362.503
SMILESCCCCC[C@H](O)\C=C\CCCCCCCc1cccc(O)c1C(O)=O