Reaction Details
TargetAcetylcholinesterase
LigandBDBM50347129
Substrate/Competitorn/a
Meas. Tech.ChEMBL_753198 (CHEMBL1799291)
IC50 17224±n/a nM
Citation Akhtar, MNLam, KWAbas, FMaulidiani, naAhmad, SShah, SAAtta-Ur-Rahman, AChoudhary, MILajis, NH New class of acetylcholinesterase inhibitors from the stem bark of Knema laurina and their structural insights. Bioorg Med Chem Lett21:4097-103 (2011) 
 
Acetylcholinesterase
Name:Acetylcholinesterase
Type:Enzyme
Mol. Mass.:71812.79
Organism:Electrophorus electricus (Electric eel)
Description:n/a
Residue:633
BDBM50347129
NameBDBM50347129
Synonyms:CHEMBL1797236
TypeSmall organic molecule
Emp. Form.C21H34O
Mol. Mass.302.4941
SMILESCCCC\C=C/CCCCCCCCCc1cccc(O)c1