Reaction Details
TargetProstaglandin G/H synthase 1
LigandBDBM22369
Substrate/Competitorn/a
Meas. Tech.ChEMBL_753438 (CHEMBL1799868)
IC50>100000±n/a nM
Citation Abdellatif, KRHuang, ZChowdhury, MAKaufman, SKnaus, EE A diazen-1-ium-1,2-diolated nitric oxide donor ester prodrug of 3-(4-hydroxymethylphenyl)-4-(4-methanesulfonylphenyl)-5H-furan-2-one: synthesis, biological evaluation and nitric oxide release studies. Bioorg Med Chem Lett21:3951-6 (2011) 
 
Prostaglandin G/H synthase 1
Name:Prostaglandin G/H synthase 1
Type:Protein
Mol. Mass.:68868.60
Organism:Ovis aries (Sheep)
Description:n/a
Residue:600
BDBM22369
NameBDBM22369
Synonyms:4-(4-methanesulfonylphenyl)-3-phenyl-2,5-dihydrofuran-2-one MK 0966 US11478464, Compound Rofecoxib | US11786535, Compound Rofecoxib
TypeSmall organic molecule
Emp. Form.C17H14O4S
Mol. Mass.314.356
SMILESCS(=O)(=O)c1ccc(cc1)C1=C(C(=O)OC1)c1ccccc1