Reaction Details
TargetDNA-dependent protein kinase catalytic subunit
LigandBDBM50347199
Substrate/Competitorn/a
Meas. Tech.ChEMBL_754403 (CHEMBL1799366)
IC50 760±n/a nM
Citation Ihmaid, SAl-Rawi, JBradley, CAngove, MJRobertson, MNClark, RL Synthesis, structural elucidation, DNA-PK inhibition, homology modelling and anti-platelet activity of morpholino-substituted-1,3-naphth-oxazines. Bioorg Med Chem19:3983-94 (2011) 
 
DNA-dependent protein kinase catalytic subunit
Name:DNA-dependent protein kinase catalytic subunit
Type:Protein
Mol. Mass.:469114.78
Organism:Homo sapiens (Human)
Description:P78527
Residue:4128
BDBM50347199
NameBDBM50347199
Synonyms:CHEMBL1795751
TypeSmall organic molecule
Emp. Form.C23H28N4O4
Mol. Mass.424.4928
SMILESCN1CCN(CCOc2cc3c(oc(nc3=O)N3CCOCC3)c3ccccc23)CC1