Reaction Details
TargetL-cysteine:1D-myo-inositol 2-amino-2-deoxy-alpha-D-glucopyranoside ligase
LigandBDBM50347267
Substrate/Competitorn/a
Meas. Tech.ChEMBL_754210 (CHEMBL1798854)
IC50 2500000±n/a nM
Citation Newton, GLBuchmeier, NLa Clair, JJFahey, RC Evaluation of NTF1836 as an inhibitor of the mycothiol biosynthetic enzyme MshC in growing and non-replicating Mycobacterium tuberculosis. Bioorg Med Chem19:3956-64 (2011) 
 
L-cysteine:1D-myo-inositol 2-amino-2-deoxy-alpha-D-glucopyranoside ligase
Name:L-cysteine:1D-myo-inositol 2-amino-2-deoxy-alpha-D-glucopyranoside ligase
Type:PROTEIN
Mol. Mass.:45583.42
Organism:Mycobacterium tuberculosis
Description:ChEMBL_754210
Residue:414
BDBM50347267
NameBDBM50347267
Synonyms:CHEMBL1796117
TypeSmall organic molecule
Emp. Form.C26H24ClN3O4S
Mol. Mass.510.004
SMILESClc1cccc(CN2c3cc(ccc3S(=O)(=O)c3ccccc3C2=O)C(=O)NCC2CCCN2)c1