Reaction Details
TargetL-cysteine:1D-myo-inositol 2-amino-2-deoxy-alpha-D-glucopyranoside ligase
LigandBDBM50347278
Substrate/Competitorn/a
Meas. Tech.ChEMBL_754210 (CHEMBL1798854)
IC50>3000000±n/a nM
Citation Newton, GLBuchmeier, NLa Clair, JJFahey, RC Evaluation of NTF1836 as an inhibitor of the mycothiol biosynthetic enzyme MshC in growing and non-replicating Mycobacterium tuberculosis. Bioorg Med Chem19:3956-64 (2011) 
 
L-cysteine:1D-myo-inositol 2-amino-2-deoxy-alpha-D-glucopyranoside ligase
Name:L-cysteine:1D-myo-inositol 2-amino-2-deoxy-alpha-D-glucopyranoside ligase
Type:PROTEIN
Mol. Mass.:45583.42
Organism:Mycobacterium tuberculosis
Description:ChEMBL_754210
Residue:414
BDBM50347278
NameBDBM50347278
Synonyms:CHEMBL1796127
TypeSmall organic molecule
Emp. Form.C30H34FN3O3S
Mol. Mass.535.673
SMILESCCCN(CCC)CCCNC(=O)c1ccc2c(c1)N(Cc1ccc(F)cc1)C(=O)c1ccccc1S2=O