Reaction Details
TargetAmine oxidase [flavin-containing] A
LigandBDBM50347297
Substrate/Competitorn/a
Meas. Tech.ChEMBL_754274 (CHEMBL1798961)
Ki 2150±n/a nM
Citation Jagrat, MBehera, JYabanoglu, SErcan, AUcar, GSinha, BNSankaran, VBasu, AJayaprakash, V Pyrazoline based MAO inhibitors: synthesis, biological evaluation and SAR studies. Bioorg Med Chem Lett21:4296-300 (2011) 
 
Amine oxidase [flavin-containing] A
Name:Amine oxidase [flavin-containing] A
Type:Protein
Mol. Mass.:59689.53
Organism:Homo sapiens (Human)
Description:P21397
Residue:527
BDBM50347297
NameBDBM50347297
Synonyms:CHEMBL1796452
TypeSmall organic molecule
Emp. Form.C23H21N3O2S
Mol. Mass.403.497
SMILESCOc1ccccc1NC(=S)N1N=C(CC1c1ccc(O)cc1)c1ccccc1