Reaction Details
TargetAmine oxidase [flavin-containing] B
LigandBDBM50347303
Substrate/Competitorn/a
Meas. Tech.ChEMBL_754275 (CHEMBL1798962)
Ki 4000±n/a nM
Citation Jagrat, MBehera, JYabanoglu, SErcan, AUcar, GSinha, BNSankaran, VBasu, AJayaprakash, V Pyrazoline based MAO inhibitors: synthesis, biological evaluation and SAR studies. Bioorg Med Chem Lett21:4296-300 (2011) 
 
Amine oxidase [flavin-containing] B
Name:Amine oxidase [flavin-containing] B
Type:Protein
Mol. Mass.:58768.76
Organism:Homo sapiens (Human)
Description:P27338
Residue:520
BDBM50347303
NameBDBM50347303
Synonyms:CHEMBL1796458
TypeSmall organic molecule
Emp. Form.C15H14N4S
Mol. Mass.282.363
SMILESNC(=S)N1N=C(CC1c1ccncc1)c1ccccc1