Reaction Details
TargetCannabinoid receptor 2
LigandBDBM50347354
Substrate/Competitorn/a
Meas. Tech.ChEMBL_755297 (CHEMBL1804297)
Ki>10000±n/a nM
Citation Bodmer-Narkevitch, VAnthony, NJCofre, VJolly, SMMurphy, KLRansom, RWReiss, DRTang, CPrueksaritanont, TPettibone, DJBock, MGKuduk, SD Indazole derivatives as novel bradykinin B1 receptor antagonists. Bioorg Med Chem Lett20:7011-4 (2010) 
 
Cannabinoid receptor 2
Name:Cannabinoid receptor 2
Type:G Protein-Coupled Receptor (GPCR)
Mol. Mass.:39690.94
Organism:Homo sapiens (Human)
Description:P34972
Residue:360
BDBM50347354
NameBDBM50347354
Synonyms:CHEMBL1801163
TypeSmall organic molecule
Emp. Form.C24H22FN5O4
Mol. Mass.463.461
SMILESCOc1cc(on1)C(=O)NC1(CC1)C(=O)N[C@H](C)c1ccc(cc1F)-n1ncc2ccccc12