Reaction Details
TargetCannabinoid receptor 1
LigandBDBM50347356
Substrate/Competitorn/a
Meas. Tech.ChEMBL_755296 (CHEMBL1804296)
Ki 19±n/a nM
Citation Bodmer-Narkevitch, VAnthony, NJCofre, VJolly, SMMurphy, KLRansom, RWReiss, DRTang, CPrueksaritanont, TPettibone, DJBock, MGKuduk, SD Indazole derivatives as novel bradykinin B1 receptor antagonists. Bioorg Med Chem Lett20:7011-4 (2010) 
 
Cannabinoid receptor 1
Name:Cannabinoid receptor 1
Type:G Protein-Coupled Receptor (GPCR)
Mol. Mass.:52868.96
Organism:Homo sapiens (Human)
Description:P21554
Residue:472
BDBM50347356
NameBDBM50347356
Synonyms:CHEMBL1801073
TypeSmall organic molecule
Emp. Form.C26H26FN5O4
Mol. Mass.491.5141
SMILESCCc1nn(-c2ccc([C@@H](C)NC(=O)C3(CC3)NC(=O)c3cc(OC)no3)c(F)c2)c2ccccc12