Reaction Details
TargetCannabinoid receptor 1
LigandBDBM50347373
Substrate/Competitorn/a
Meas. Tech.ChEMBL_755296 (CHEMBL1804296)
Ki 0.38±n/a nM
Citation Bodmer-Narkevitch, VAnthony, NJCofre, VJolly, SMMurphy, KLRansom, RWReiss, DRTang, CPrueksaritanont, TPettibone, DJBock, MGKuduk, SD Indazole derivatives as novel bradykinin B1 receptor antagonists. Bioorg Med Chem Lett20:7011-4 (2010) 
 
Cannabinoid receptor 1
Name:Cannabinoid receptor 1
Type:G Protein-Coupled Receptor (GPCR)
Mol. Mass.:52868.96
Organism:Homo sapiens (Human)
Description:P21554
Residue:472
BDBM50347373
NameBDBM50347373
Synonyms:CHEMBL1801341
TypeSmall organic molecule
Emp. Form.C23H20ClFN6O2
Mol. Mass.466.895
SMILESC[C@@H](NC(=O)C1(CC1)NC(=O)c1cn[nH]c1)c1ccc(cc1F)-n1nc(Cl)c2ccccc12