Reaction Details
TargetHeat shock protein HSP 90-alpha
LigandBDBM15372
Substrate/Competitorn/a
Meas. Tech.ChEMBL_754512 (CHEMBL1806176)
EC50 350±n/a nM
Citation Bruncko, MTahir, SKSong, XChen, JDing, HHuth, JRJin, SJudge, RAMadar, DJPark, CHPark, CMPetros, AMTse, CRosenberg, SHElmore, SW N-aryl-benzimidazolones as novel small molecule HSP90 inhibitors. Bioorg Med Chem Lett20:7503-6 (2010) 
 
Heat shock protein HSP 90-alpha
Name:Heat shock protein HSP 90-alpha
Type:Molecular Chaperone
Mol. Mass.:84623.45
Organism:Homo sapiens (Human)
Description:P07900
Residue:732
BDBM15372
NameBDBM15372
Synonyms:3-(5-chloro-2,4-dihydroxyphenyl)-N-ethyl-4-(4-methoxyphenyl)-1H-pyrazole-5-carboxamide Compound 11 VER-49009
TypeSmall organic molecule
Emp. Form.C19H18ClN3O4
Mol. Mass.387.817
SMILESCCNC(=O)c1[nH]nc(c1-c1ccc(OC)cc1)-c1cc(Cl)c(O)cc1O