Reaction Details
TargetGlycogen synthase kinase-3 beta
LigandBDBM50347526
Substrate/Competitorn/a
Meas. Tech.ChEMBL_755831 (CHEMBL1803565)
IC50 500±n/a nM
Citation Perez, DIPalomo, VPérez, CGil, CDans, PDLuque, FJConde, SMartínez, A Switching reversibility to irreversibility in glycogen synthase kinase 3 inhibitors: clues for specific design of new compounds. J Med Chem54:4042-56 (2011) 
 
Glycogen synthase kinase-3 beta
Name:Glycogen synthase kinase-3 beta
Type:Enzyme
Mol. Mass.:46756.38
Organism:Homo sapiens (Human)
Description:P49841
Residue:420
BDBM50347526
NameBDBM50347526
Synonyms:CHEMBL1801628
TypeSmall organic molecule
Emp. Form.C8H5Br4NO
Mol. Mass.450.747
SMILESNc1c(Br)cc(cc1Br)C(=O)C(Br)Br