Reaction Details
TargetMelatonin receptor type 1A
LigandBDBM50347585
Substrate/Competitorn/a
Meas. Tech.ChEMBL_755971 (CHEMBL1803861)
Ki 0.082±n/a nM
Citation Koike, TTakai, THoashi, YNakayama, MKosugi, YNakashima, MYoshikubo, SHirai, KUchikawa, O Synthesis of a novel series of tricyclic dihydrofuran derivatives: discovery of 8,9-dihydrofuro[3,2-c]pyrazolo[1,5-a]pyridines as melatonin receptor (MT1/MT2) ligands. J Med Chem54:4207-18 (2011) 
 
Melatonin receptor type 1A
Name:Melatonin receptor type 1A
Type:Enzyme
Mol. Mass.:39392.94
Organism:Homo sapiens (Human)
Description:P48039
Residue:350
BDBM50347585
NameBDBM50347585
Synonyms:CHEMBL1802022
TypeSmall organic molecule
Emp. Form.C19H19N3O2
Mol. Mass.321.3731
SMILESCC(=O)NCCc1c(nn2ccc3OCCc3c12)-c1ccccc1