Reaction Details
TargetMelatonin receptor type 1B
LigandBDBM50347593
Substrate/Competitorn/a
Meas. Tech.ChEMBL_755972 (CHEMBL1803862)
Ki 0.22±n/a nM
Citation Koike, TTakai, THoashi, YNakayama, MKosugi, YNakashima, MYoshikubo, SHirai, KUchikawa, O Synthesis of a novel series of tricyclic dihydrofuran derivatives: discovery of 8,9-dihydrofuro[3,2-c]pyrazolo[1,5-a]pyridines as melatonin receptor (MT1/MT2) ligands. J Med Chem54:4207-18 (2011) 
 
Melatonin receptor type 1B
Name:Melatonin receptor type 1B
Type:Enzyme
Mol. Mass.:40203.54
Organism:Homo sapiens (Human)
Description:P49286
Residue:362
BDBM50347593
NameBDBM50347593
Synonyms:CHEMBL1802026
TypeSmall organic molecule
Emp. Form.C16H21N3O2
Mol. Mass.287.3568
SMILESCCC(=O)NCCc1c(CC)nn2ccc3OCCc3c12