Reaction Details
TargetHistone-lysine N-methyltransferase SETD7
LigandBDBM50347705
Substrate/Competitorn/a
Meas. Tech.ChEMBL_756196 (CHEMBL1804746)
IC50 174000±n/a nM
Citation Cheng, DValente, SCastellano, SSbardella, GDi Santo, RCosti, RBedford, MTMai, A Novel 3,5-bis(bromohydroxybenzylidene)piperidin-4-ones as coactivator-associated arginine methyltransferase 1 inhibitors: enzyme selectivity and cellular activity. J Med Chem54:4928-32 (2011) 
 
Histone-lysine N-methyltransferase SETD7
Name:Histone-lysine N-methyltransferase SETD7
Type:Enzyme
Mol. Mass.:40691.12
Organism:Homo sapiens (Human)
Description:Q8WTS6
Residue:366
BDBM50347705
NameBDBM50347705
Synonyms:CHEMBL1802461
TypeSmall organic molecule
Emp. Form.C26H20Br2ClNO3
Mol. Mass.589.703
SMILESOc1ccc(\C=C2/CN(Cc3cccc(Cl)c3)C\C(=C/c3ccc(O)c(Br)c3)C2=O)cc1Br