Reaction Details
TargetTransforming protein RhoA
LigandBDBM50347735
Substrate/Competitorn/a
Meas. Tech.ChEMBL_756284 (CHEMBL1805097)
Kd 1.31E4±n/a nM
Citation Deng, JFeng, EMa, SZhang, YLiu, XLi, HHuang, HZhu, JZhu, WShen, XMiao, LLiu, HJiang, HLi, J Design and synthesis of small molecule RhoA inhibitors: a new promising therapy for cardiovascular diseases? J Med Chem54:4508-22 (2011) 
 
Transforming protein RhoA
Name:Transforming protein RhoA
Type:PROTEIN
Mol. Mass.:21766.89
Organism:Homo sapiens (Human)
Description:ChEMBL_966397
Residue:193
BDBM50347735
NameBDBM50347735
Synonyms:CHEMBL1802523
TypeSmall organic molecule
Emp. Form.C20H13NO5S
Mol. Mass.379.386
SMILESOS(=O)(=O)c1ccc2c(NC3=CC(=O)C(=O)c4ccccc34)cccc2c1