Reaction Details
TargetDual specificity protein kinase CLK3
LigandBDBM50347749
Substrate/Competitorn/a
Meas. Tech.ChEMBL_756289 (CHEMBL1805102)
IC50>10000±n/a nM
Citation Debdab, MCarreaux, FRenault, SSoundararajan, MFedorov, OFilippakopoulos, PLozach, OBabault, LTahtouh, TBaratte, BOgawa, YHagiwara, MEisenreich, ARauch, UKnapp, SMeijer, LBazureau, JP Leucettines, a class of potent inhibitors of cdc2-like kinases and dual specificity, tyrosine phosphorylation regulated kinases derived from the marine sponge leucettamine B: modulation of alternative pre-RNA splicing. J Med Chem54:4172-86 (2011) 
 
Dual specificity protein kinase CLK3
Name:Dual specificity protein kinase CLK3
Type:PROTEIN
Mol. Mass.:73855.32
Organism:Mus musculus
Description:ChEMBL_1502247
Residue:638
BDBM50347749
NameBDBM50347749
Synonyms:CHEMBL1802357
TypeSmall organic molecule
Emp. Form.C19H15N3O5
Mol. Mass.365.3395
SMILESO=C1NC(Nc2ccc3OCCOc3c2)=NC1=Cc1ccc2OCOc2c1