Reaction Details
TargetDual specificity protein kinase CLK1
LigandBDBM50347777
Substrate/Competitorn/a
Meas. Tech.ChEMBL_756288 (CHEMBL1805101)
IC50 230±n/a nM
Citation Debdab, MCarreaux, FRenault, SSoundararajan, MFedorov, OFilippakopoulos, PLozach, OBabault, LTahtouh, TBaratte, BOgawa, YHagiwara, MEisenreich, ARauch, UKnapp, SMeijer, LBazureau, JP Leucettines, a class of potent inhibitors of cdc2-like kinases and dual specificity, tyrosine phosphorylation regulated kinases derived from the marine sponge leucettamine B: modulation of alternative pre-RNA splicing. J Med Chem54:4172-86 (2011) 
 
Dual specificity protein kinase CLK1
Name:Dual specificity protein kinase CLK1
Type:PROTEIN
Mol. Mass.:57124.52
Organism:Mus musculus
Description:ChEMBL_1502245
Residue:483
BDBM50347777
NameBDBM50347777
Synonyms:CHEMBL1803068
TypeSmall organic molecule
Emp. Form.C20H17N3O5
Mol. Mass.379.3661
SMILESCN1C(=O)C(=Cc2ccc3OCOc3c2)N=C1NCc1ccc2OCOc2c1