Reaction Details
TargetDual specificity tyrosine-phosphorylation-regulated kinase 1A
LigandBDBM50347792
Substrate/Competitorn/a
Meas. Tech.ChEMBL_756466 (CHEMBL1804241)
IC50 39±n/a nM
Citation Giraud, FAlves, GDebiton, ENauton, LThéry, VDurieu, EFerandin, YLozach, OMeijer, LAnizon, FPereira, EMoreau, P Synthesis, protein kinase inhibitory potencies, and in vitro antiproliferative activities of meridianin derivatives. J Med Chem54:4474-89 (2011) 
 
Dual specificity tyrosine-phosphorylation-regulated kinase 1A
Name:Dual specificity tyrosine-phosphorylation-regulated kinase 1A
Type:Enzyme Catalytic Domain
Mol. Mass.:85573.59
Organism:RAT
Description:Dual-specificity tyrosine-(Y)-phosphorylation regulated kinase 1A 0 RAT::Q63470
Residue:763
BDBM50347792
NameBDBM50347792
Synonyms:CHEMBL1802967
TypeSmall organic molecule
Emp. Form.C12H8BrIN4
Mol. Mass.415.027
SMILESNc1ncc(I)c(n1)-c1c[nH]c2c(Br)cccc12