Reaction Details
TargetSerine/threonine-protein kinase Nek2
LigandBDBM50347865
Substrate/Competitorn/a
Meas. Tech.ChEMBL_756564 (CHEMBL1804637)
IC50 20±n/a nM
Citation Henise, JCTaunton, J Irreversible Nek2 kinase inhibitors with cellular activity. J Med Chem54:4133-46 (2011) 
 
Serine/threonine-protein kinase Nek2
Name:Serine/threonine-protein kinase Nek2
Type:Enzyme
Mol. Mass.:51776.96
Organism:Homo sapiens (Human)
Description:P51955
Residue:445
BDBM50347865
NameBDBM50347865
Synonyms:CHEMBL1802383
TypeSmall organic molecule
Emp. Form.C15H12ClN3O2
Mol. Mass.301.728
SMILESCc1nc[nH]c1C=C1C(=O)Nc2ccc(cc12)C(=O)CCl