Reaction Details
TargetInterferon-induced, double-stranded RNA-activated protein kinase
LigandBDBM50347871
Substrate/Competitorn/a
Meas. Tech.ChEMBL_756679 (CHEMBL1805144)
Ki 3400±n/a nM
Citation Bryk, RWu, KRaimundo, BCBoardman, PEChao, PConn, GLAnderson, ECole, JLDuffy, NPNathan, CGriffin, JH Identification of new inhibitors of protein kinase R guided by statistical modeling. Bioorg Med Chem Lett21:4108-14 (2011) 
 
Interferon-induced, double-stranded RNA-activated protein kinase
Name:Interferon-induced, double-stranded RNA-activated protein kinase
Type:PROTEIN
Mol. Mass.:62104.61
Organism:Homo sapiens (Human)
Description:ChEMBL_1467743
Residue:551
BDBM50347871
NameBDBM50347871
Synonyms:CHEMBL1802618
TypeSmall organic molecule
Emp. Form.C23H21N5
Mol. Mass.367.4463
SMILESCc1[nH]c2ccccc2c1-c1ccnc(NCCc2c[nH]c3ccccc23)n1