Reaction Details
TargetInterferon-induced, double-stranded RNA-activated protein kinase
LigandBDBM6877
Substrate/Competitorn/a
Meas. Tech.ChEMBL_756675 (CHEMBL1805140)
IC50 8000±n/a nM
Citation Bryk, RWu, KRaimundo, BCBoardman, PEChao, PConn, GLAnderson, ECole, JLDuffy, NPNathan, CGriffin, JH Identification of new inhibitors of protein kinase R guided by statistical modeling. Bioorg Med Chem Lett21:4108-14 (2011) 
 
Interferon-induced, double-stranded RNA-activated protein kinase
Name:Interferon-induced, double-stranded RNA-activated protein kinase
Type:PROTEIN
Mol. Mass.:62104.61
Organism:Homo sapiens (Human)
Description:ChEMBL_1467743
Residue:551
BDBM6877
NameBDBM6877
Synonyms:1-Acyl-1H-[1,2,4]triazole-3,5-diamine Analogue 3m 5-amino-N-(2,6-difluorophenyl)-3-[(4-sulfamoylphenyl)amino]-1H-1,2,4-triazole-1-carboxamide
TypeSmall organic molecule
Emp. Form.C15H13F2N7O3S
Mol. Mass.409.371
SMILESNc1nc(Nc2ccc(cc2)S(N)(=O)=O)nn1C(=O)Nc1c(F)cccc1F