Reaction Details
TargetProtein-S-isoprenylcysteine O-methyltransferase
LigandBDBM50348021
Substrate/Competitorn/a
Meas. Tech.ChEMBL_757250 (CHEMBL1803626)
IC50 31±n/a nM
Citation Judd, WRSlattum, PMHoang, KCBhoite, LValppu, LAlberts, GBrown, BRoth, BOstanin, KHuang, LWettstein, DRichards, BWillardsen, JA Discovery and SAR of methylated tetrahydropyranyl derivatives as inhibitors of isoprenylcysteine carboxyl methyltransferase (ICMT). J Med Chem54:5031-47 (2011) 
 
Protein-S-isoprenylcysteine O-methyltransferase
Name:Protein-S-isoprenylcysteine O-methyltransferase
Type:PROTEIN
Mol. Mass.:31943.26
Organism:Homo sapiens (Human)
Description:ChEMBL_956034
Residue:284
BDBM50348021
NameBDBM50348021
Synonyms:CHEMBL1800418
TypeSmall organic molecule
Emp. Form.C22H29NO
Mol. Mass.323.4718
SMILESCc1ccc(NCCC2(CCOC(C)(C)C2)c2ccccc2)cc1