Reaction Details
TargetProtein-S-isoprenylcysteine O-methyltransferase
LigandBDBM50348031
Substrate/Competitorn/a
Meas. Tech.ChEMBL_757250 (CHEMBL1803626)
IC50 90±n/a nM
Citation Judd, WRSlattum, PMHoang, KCBhoite, LValppu, LAlberts, GBrown, BRoth, BOstanin, KHuang, LWettstein, DRichards, BWillardsen, JA Discovery and SAR of methylated tetrahydropyranyl derivatives as inhibitors of isoprenylcysteine carboxyl methyltransferase (ICMT). J Med Chem54:5031-47 (2011) 
 
Protein-S-isoprenylcysteine O-methyltransferase
Name:Protein-S-isoprenylcysteine O-methyltransferase
Type:PROTEIN
Mol. Mass.:31943.26
Organism:Homo sapiens (Human)
Description:ChEMBL_956034
Residue:284
BDBM50348031
NameBDBM50348031
Synonyms:CHEMBL1800477
TypeSmall organic molecule
Emp. Form.C23H31NO2
Mol. Mass.353.4977
SMILESCOc1cc(NCCC2(CCOC(C)(C)C2)c2ccccc2)ccc1C