Reaction Details
TargetProtein-S-isoprenylcysteine O-methyltransferase
LigandBDBM50348052
Substrate/Competitorn/a
Meas. Tech.ChEMBL_757250 (CHEMBL1803626)
IC50 32±n/a nM
Citation Judd, WRSlattum, PMHoang, KCBhoite, LValppu, LAlberts, GBrown, BRoth, BOstanin, KHuang, LWettstein, DRichards, BWillardsen, JA Discovery and SAR of methylated tetrahydropyranyl derivatives as inhibitors of isoprenylcysteine carboxyl methyltransferase (ICMT). J Med Chem54:5031-47 (2011) 
 
Protein-S-isoprenylcysteine O-methyltransferase
Name:Protein-S-isoprenylcysteine O-methyltransferase
Type:PROTEIN
Mol. Mass.:31943.26
Organism:Homo sapiens (Human)
Description:ChEMBL_956034
Residue:284
BDBM50348052
NameBDBM50348052
Synonyms:CHEMBL1800499
TypeSmall organic molecule
Emp. Form.C21H25ClFNO
Mol. Mass.361.881
SMILESCC1(C)CC(CCNc2cc(Cl)ccc2F)(CCO1)c1ccccc1