Reaction Details
TargetProtein-S-isoprenylcysteine O-methyltransferase
LigandBDBM50348068
Substrate/Competitorn/a
Meas. Tech.ChEMBL_757250 (CHEMBL1803626)
IC50 3.8±n/a nM
Citation Judd, WRSlattum, PMHoang, KCBhoite, LValppu, LAlberts, GBrown, BRoth, BOstanin, KHuang, LWettstein, DRichards, BWillardsen, JA Discovery and SAR of methylated tetrahydropyranyl derivatives as inhibitors of isoprenylcysteine carboxyl methyltransferase (ICMT). J Med Chem54:5031-47 (2011) 
 
Protein-S-isoprenylcysteine O-methyltransferase
Name:Protein-S-isoprenylcysteine O-methyltransferase
Type:PROTEIN
Mol. Mass.:31943.26
Organism:Homo sapiens (Human)
Description:ChEMBL_956034
Residue:284
BDBM50348068
NameBDBM50348068
Synonyms:CHEMBL1800516
TypeSmall organic molecule
Emp. Form.C19H24ClNOS
Mol. Mass.349.918
SMILESCC1(C)CC(CCNc2cccc(Cl)c2)(CCO1)c1cccs1