Reaction Details
TargetCannabinoid receptor 1
LigandBDBM50171296
Substrate/Competitorn/a
Meas. Tech.ChEMBL_757147 (CHEMBL1803287)
Ki 25±n/a nM
Citation Martín-Couce, LMartín-Fontecha, MCapolicchio, SLópez-Rodríguez, MLOrtega-Gutiérrez, S Development of endocannabinoid-based chemical probes for the study of cannabinoid receptors. J Med Chem54:5265-9 (2011) 
 
Cannabinoid receptor 1
Name:Cannabinoid receptor 1
Type:G Protein-Coupled Receptor (GPCR)
Mol. Mass.:52868.96
Organism:Homo sapiens (Human)
Description:P21554
Residue:472
BDBM50171296
NameBDBM50171296
Synonyms:2-[((11Z,14Z)-Icosa-5,8,11,14-tetraenyl)oxy]-propane-1,3-diol 2-[(5Z,8Z,11Z,14Z)-icosa-5,8,11,14-tetraenyloxy]propane-1,3-diol HU-310
TypeSmall organic molecule
Emp. Form.C23H40O3
Mol. Mass.364.5619
SMILESCCCCC\C=C/C\C=C/C\C=C/C\C=C/CCCCOC(CO)CO