Reaction Details
TargetCannabinoid receptor 1
LigandBDBM50348137
Substrate/Competitorn/a
Meas. Tech.ChEMBL_757147 (CHEMBL1803287)
Ki 2000±n/a nM
Citation Martín-Couce, LMartín-Fontecha, MCapolicchio, SLópez-Rodríguez, MLOrtega-Gutiérrez, S Development of endocannabinoid-based chemical probes for the study of cannabinoid receptors. J Med Chem54:5265-9 (2011) 
 
Cannabinoid receptor 1
Name:Cannabinoid receptor 1
Type:G Protein-Coupled Receptor (GPCR)
Mol. Mass.:52868.96
Organism:Homo sapiens (Human)
Description:P21554
Residue:472
BDBM50348137
NameBDBM50348137
Synonyms:CHEMBL1800727
TypeSmall organic molecule
Emp. Form.C39H64N4O5S
Mol. Mass.701.014
SMILESCCCCC\C=C/C\C=C/C\C=C/C\C=C/CCCC(=O)N[C@H](C)COC(=O)CCCCCNC(=O)CCCC[C@@H]1SC[C@@H]2NC(=O)N[C@H]12