Reaction Details
TargetCannabinoid receptor 2
LigandBDBM50348136
Substrate/Competitorn/a
Meas. Tech.ChEMBL_757148 (CHEMBL1803288)
Ki>2000±n/a nM
Citation Martín-Couce, LMartín-Fontecha, MCapolicchio, SLópez-Rodríguez, MLOrtega-Gutiérrez, S Development of endocannabinoid-based chemical probes for the study of cannabinoid receptors. J Med Chem54:5265-9 (2011) 
 
Cannabinoid receptor 2
Name:Cannabinoid receptor 2
Type:G Protein-Coupled Receptor (GPCR)
Mol. Mass.:39690.94
Organism:Homo sapiens (Human)
Description:P34972
Residue:360
BDBM50348136
NameBDBM50348136
Synonyms:CHEMBL1800182
TypeSmall organic molecule
Emp. Form.C38H62N4O6S
Mol. Mass.702.987
SMILESC[C@H](CO)NC(=O)CCC\C=C/C\C=C/C\C=C/C\C=C/CCCCOC(=O)CCCCCNC(=O)CCCC[C@@H]1SC[C@@H]2NC(=O)N[C@H]12