Reaction Details
TargetCannabinoid receptor 2
LigandBDBM50348142
Substrate/Competitorn/a
Meas. Tech.ChEMBL_757148 (CHEMBL1803288)
Ki 84.9±n/a nM
Citation Martín-Couce, LMartín-Fontecha, MCapolicchio, SLópez-Rodríguez, MLOrtega-Gutiérrez, S Development of endocannabinoid-based chemical probes for the study of cannabinoid receptors. J Med Chem54:5265-9 (2011) 
 
Cannabinoid receptor 2
Name:Cannabinoid receptor 2
Type:G Protein-Coupled Receptor (GPCR)
Mol. Mass.:39690.94
Organism:Homo sapiens (Human)
Description:P34972
Residue:360
BDBM50348142
NameBDBM50348142
Synonyms:CHEMBL1800732
TypeSmall organic molecule
Emp. Form.C29H46O4
Mol. Mass.458.6731
SMILESCCCCC\C=C/C\C=C/C\C=C/C\C=C/CCCCOC(CO)COC(=O)CCCC#C