Reaction Details
TargetE3 ubiquitin-protein ligase XIAP
LigandBDBM50348195
Substrate/Competitorn/a
Meas. Tech.ChEMBL_757199 (CHEMBL1803423)
Ki 440±n/a nM
Citation González-López, MWelsh, KFinlay, DArdecky, RJGanji, SRSu, YYuan, HTeriete, PMace, PDRiedl, SJVuori, KReed, JCCosford, ND Design, synthesis and evaluation of monovalent Smac mimetics that bind to the BIR2 domain of the anti-apoptotic protein XIAP. Bioorg Med Chem Lett21:4332-6 (2011) 
 
E3 ubiquitin-protein ligase XIAP
Name:E3 ubiquitin-protein ligase XIAP
Type:Protein
Mol. Mass.:56685.27
Organism:Homo sapiens (Human)
Description:P98170
Residue:497
BDBM50348195
NameBDBM50348195
Synonyms:CHEMBL1800078
TypeSmall organic molecule
Emp. Form.C27H36N4O3
Mol. Mass.464.5997
SMILESCN[C@@H](C)C(=O)N[C@@H](C(C)C)C(=O)N1CCC[C@H]1C(=O)NC(c1ccccc1)c1ccccc1