Reaction Details
TargetHistone deacetylase 5
LigandBDBM96613
Substrate/Competitorn/a
Meas. Tech.ChEMBL_757637 (CHEMBL1804894)
IC50>100000±n/a nM
Citation Kemp, MMWang, QFuller, JHWest, NMartinez, NMMorse, EMWeïwer, MSchreiber, SLBradner, JEKoehler, AN A novel HDAC inhibitor with a hydroxy-pyrimidine scaffold. Bioorg Med Chem Lett21:4164-9 (2011) 
 
Histone deacetylase 5
Name:Histone deacetylase 5
Type:Enzyme
Mol. Mass.:121968.61
Organism:Homo sapiens (Human)
Description:Q9UQL6
Residue:1122
BDBM96613
NameBDBM96613
Synonyms:2-[(4-keto-6-methyl-1H-pyrimidin-2-yl)thio]-N-phenethyl-acetamide 2-[(6-methyl-4-oxidanylidene-1H-pyrimidin-2-yl)sulfanyl]-N-(2-phenylethyl)ethanamide 2-[(6-methyl-4-oxo-1H-pyrimidin-2-yl)thio]-N-(2-phenylethyl)acetamide MLS000531589 cid_892234
TypeSmall organic molecule
Emp. Form.C15H17N3O2S
Mol. Mass.303.379
SMILESCc1cc(=O)[nH]c(SCC(=O)NCCc2ccccc2)n1