Reaction Details
TargetHistone deacetylase 5
LigandBDBM50348375
Substrate/Competitorn/a
Meas. Tech.ChEMBL_757637 (CHEMBL1804894)
IC50 94300±n/a nM
Citation Kemp, MMWang, QFuller, JHWest, NMartinez, NMMorse, EMWeïwer, MSchreiber, SLBradner, JEKoehler, AN A novel HDAC inhibitor with a hydroxy-pyrimidine scaffold. Bioorg Med Chem Lett21:4164-9 (2011) 
 
Histone deacetylase 5
Name:Histone deacetylase 5
Type:Enzyme
Mol. Mass.:121968.61
Organism:Homo sapiens (Human)
Description:Q9UQL6
Residue:1122
BDBM50348375
NameBDBM50348375
Synonyms:CHEMBL1800374
TypeSmall organic molecule
Emp. Form.C17H20N2O2S
Mol. Mass.316.418
SMILESCc1cc(=O)[nH]c(SCC(=O)c2ccc(cc2)C(C)(C)C)n1