Reaction Details
TargetHistone deacetylase 6
LigandBDBM50348376
Substrate/Competitorn/a
Meas. Tech.ChEMBL_757638 (CHEMBL1804895)
IC50 12900±n/a nM
Citation Kemp, MMWang, QFuller, JHWest, NMartinez, NMMorse, EMWeïwer, MSchreiber, SLBradner, JEKoehler, AN A novel HDAC inhibitor with a hydroxy-pyrimidine scaffold. Bioorg Med Chem Lett21:4164-9 (2011) 
 
Histone deacetylase 6
Name:Histone deacetylase 6
Type:Chromatin regulator; hydrolase; repressor
Mol. Mass.:131381.51
Organism:Homo sapiens (Human)
Description:Q9UBN7
Residue:1215
BDBM50348376
NameBDBM50348376
Synonyms:CHEMBL1800375
TypeSmall organic molecule
Emp. Form.C13H11ClN2O2S
Mol. Mass.294.757
SMILESCc1cc(=O)[nH]c(SCC(=O)c2ccc(Cl)cc2)n1