Reaction Details
TargetHistone deacetylase 6
LigandBDBM50348380
Substrate/Competitorn/a
Meas. Tech.ChEMBL_757638 (CHEMBL1804895)
IC50 24800±n/a nM
Citation Kemp, MMWang, QFuller, JHWest, NMartinez, NMMorse, EMWeïwer, MSchreiber, SLBradner, JEKoehler, AN A novel HDAC inhibitor with a hydroxy-pyrimidine scaffold. Bioorg Med Chem Lett21:4164-9 (2011) 
 
Histone deacetylase 6
Name:Histone deacetylase 6
Type:Chromatin regulator; hydrolase; repressor
Mol. Mass.:131381.51
Organism:Homo sapiens (Human)
Description:Q9UBN7
Residue:1215
BDBM50348380
NameBDBM50348380
Synonyms:CHEMBL1800379
TypeSmall organic molecule
Emp. Form.C11H10N2O2S2
Mol. Mass.266.339
SMILESCc1cc(=O)[nH]c(SCC(=O)c2cccs2)n1