Reaction Details
TargetHistone deacetylase 8
LigandBDBM50348388
Substrate/Competitorn/a
Meas. Tech.ChEMBL_757640 (CHEMBL1804897)
IC50 23900±n/a nM
Citation Kemp, MMWang, QFuller, JHWest, NMartinez, NMMorse, EMWeïwer, MSchreiber, SLBradner, JEKoehler, AN A novel HDAC inhibitor with a hydroxy-pyrimidine scaffold. Bioorg Med Chem Lett21:4164-9 (2011) 
 
Histone deacetylase 8
Name:Histone deacetylase 8
Type:Enzyme
Mol. Mass.:41749.60
Organism:Homo sapiens (Human)
Description:Q9BY41
Residue:377
BDBM50348388
NameBDBM50348388
Synonyms:CHEMBL1800241
TypeSmall organic molecule
Emp. Form.C15H15N3O3S
Mol. Mass.317.363
SMILESCC(=O)Nc1ccc(cc1)C(=O)CSc1nc(C)cc(=O)[nH]1