Reaction Details
TargetHistone deacetylase 1
LigandBDBM50348376
Substrate/Competitorn/a
Meas. Tech.ChEMBL_757633 (CHEMBL1804890)
IC50 82300±n/a nM
Citation Kemp, MMWang, QFuller, JHWest, NMartinez, NMMorse, EMWeïwer, MSchreiber, SLBradner, JEKoehler, AN A novel HDAC inhibitor with a hydroxy-pyrimidine scaffold. Bioorg Med Chem Lett21:4164-9 (2011) 
 
Histone deacetylase 1
Name:Histone deacetylase 1
Type:Enzyme
Mol. Mass.:55090.27
Organism:Homo sapiens (Human)
Description:Q13547
Residue:482
BDBM50348376
NameBDBM50348376
Synonyms:CHEMBL1800375
TypeSmall organic molecule
Emp. Form.C13H11ClN2O2S
Mol. Mass.294.757
SMILESCc1cc(=O)[nH]c(SCC(=O)c2ccc(Cl)cc2)n1