Reaction Details
TargetHistone deacetylase 2
LigandBDBM50348375
Substrate/Competitorn/a
Meas. Tech.ChEMBL_757634 (CHEMBL1804891)
IC50>100000±n/a nM
Citation Kemp, MMWang, QFuller, JHWest, NMartinez, NMMorse, EMWeïwer, MSchreiber, SLBradner, JEKoehler, AN A novel HDAC inhibitor with a hydroxy-pyrimidine scaffold. Bioorg Med Chem Lett21:4164-9 (2011) 
 
Histone deacetylase 2
Name:Histone deacetylase 2
Type:Chromatin regulator; hydrolase; repressor
Mol. Mass.:55356.54
Organism:Homo sapiens (Human)
Description:Q92769
Residue:488
BDBM50348375
NameBDBM50348375
Synonyms:CHEMBL1800374
TypeSmall organic molecule
Emp. Form.C17H20N2O2S
Mol. Mass.316.418
SMILESCc1cc(=O)[nH]c(SCC(=O)c2ccc(cc2)C(C)(C)C)n1