Reaction Details
TargetHistone deacetylase 4
LigandBDBM50348393
Substrate/Competitorn/a
Meas. Tech.ChEMBL_757636 (CHEMBL1804893)
IC50 54200±n/a nM
Citation Kemp, MMWang, QFuller, JHWest, NMartinez, NMMorse, EMWeïwer, MSchreiber, SLBradner, JEKoehler, AN A novel HDAC inhibitor with a hydroxy-pyrimidine scaffold. Bioorg Med Chem Lett21:4164-9 (2011) 
 
Histone deacetylase 4
Name:Histone deacetylase 4
Type:Enzyme
Mol. Mass.:119049.39
Organism:Homo sapiens (Human)
Description:P56524
Residue:1084
BDBM50348393
NameBDBM50348393
Synonyms:CHEMBL1800246
TypeSmall organic molecule
Emp. Form.C15H15N3O4
Mol. Mass.301.2973
SMILESCC(=O)Nc1ccc(cc1)C(=O)COc1nc(C)cc(=O)[nH]1