Reaction Details
TargetSerine/threonine-protein kinase mTOR
LigandBDBM50348452
Substrate/Competitorn/a
Meas. Tech.ChEMBL_755446 (CHEMBL1804915)
IC50 0.8±n/a nM
Citation García-Echeverría, C Allosteric and ATP-competitive kinase inhibitors of mTOR for cancer treatment. Bioorg Med Chem Lett20:4308-12 (2010) 
 
Serine/threonine-protein kinase mTOR
Name:Serine/threonine-protein kinase mTOR
Type:Rapamycin target protein
Mol. Mass.:288917.12
Organism:Homo sapiens (Human)
Description:P42345
Residue:2549
BDBM50348452
NameBDBM50348452
Synonyms:AZD-8055 US9102670, 1a
TypeSmall organic molecule
Emp. Form.C25H31N5O4
Mol. Mass.465.5447
SMILESCOc1ccc(cc1CO)-c1ccc2c(nc(nc2n1)N1CCOC[C@@H]1C)N1CCOC[C@@H]1C