Reaction Details
TargetVoltage-dependent calcium channel subunit alpha-2/delta-1
LigandBDBM50348455
Substrate/Competitorn/a
Meas. Tech.ChEMBL_754894 (CHEMBL1805878)
IC50 8±n/a nM
Citation Myatt, JWHealy, MPBravi, GSBillinton, AJohnson, CNMatthews, KLJandu, KSMeng, WHersey, ALivermore, DGDouault, CBWitherington, JBit, RARowedder, JEBrown, JDClayton, NM Pyrazolopyridazine alpha-2-delta-1 ligands for the treatment of neuropathic pain. Bioorg Med Chem Lett20:4683-8 (2010) 
 
Voltage-dependent calcium channel subunit alpha-2/delta-1
Name:Voltage-dependent calcium channel subunit alpha-2/delta-1
Type:Enzyme
Mol. Mass.:124544.88
Organism:Homo sapiens (Human)
Description:P54289
Residue:1103
BDBM50348455
NameBDBM50348455
Synonyms:CHEMBL1801192
TypeSmall organic molecule
Emp. Form.C19H22FN5O2
Mol. Mass.371.4087
SMILESCCOc1ccc(c(F)c1)-n1nc2c(nnc(C)c2c1C)N1CC(C1)OC