Reaction Details
TargetAurora kinase B
LigandBDBM50348641
Substrate/Competitorn/a
Meas. Tech.ChEMBL_755593 (CHEMBL1805333)
IC50 24±n/a nM
Citation Belanger, DBCurran, PJHruza, AVoigt, JMeng, ZMandal, AKSiddiqui, MABasso, ADGray, K Discovery of imidazo[1,2-a]pyrazine-based Aurora kinase inhibitors. Bioorg Med Chem Lett20:5170-4 (2010) 
 
Aurora kinase B
Name:Aurora kinase B
Type:Protein
Mol. Mass.:39327.72
Organism:Homo sapiens (Human)
Description:Q96GD4
Residue:344
BDBM50348641
NameBDBM50348641
Synonyms:CHEMBL1801131
TypeSmall organic molecule
Emp. Form.C15H15N7S2
Mol. Mass.357.457
SMILESCCSc1cn2c(cnc2c(Nc2cc(C)ns2)n1)-c1cn[nH]c1