Reaction Details
TargetAurora kinase B
LigandBDBM50348638
Substrate/Competitorn/a
Meas. Tech.ChEMBL_755593 (CHEMBL1805333)
IC50 62±n/a nM
Citation Belanger, DBCurran, PJHruza, AVoigt, JMeng, ZMandal, AKSiddiqui, MABasso, ADGray, K Discovery of imidazo[1,2-a]pyrazine-based Aurora kinase inhibitors. Bioorg Med Chem Lett20:5170-4 (2010) 
 
Aurora kinase B
Name:Aurora kinase B
Type:Protein
Mol. Mass.:39327.72
Organism:Homo sapiens (Human)
Description:Q96GD4
Residue:344
BDBM50348638
NameBDBM50348638
Synonyms:CHEMBL1800086
TypeSmall organic molecule
Emp. Form.C18H14N8S
Mol. Mass.374.422
SMILESCc1cc(Nc2nc(cn3c(cnc23)-c2cn[nH]c2)-c2cccnc2)sn1